{"text_format":"1","workbook":"xlsx","n_sheets":16,"sheets":["Intro","Controls","Requirements","Rents and Income","Development Costs","Repl Reserve","Const Schedule","LIHTC Basis","Operating Expenses","First Mortgage Sizing","Sources and Uses","S&U By Month","Pro Forma Assumptions","Operating Pro Forma","Administrative Record","Summary"],"not_rendered":{"charts":0,"images":0,"macros":1,"external_links":0,"defined_names":27,"comments":15,"pivot_tables":0},"unopened":[],"bounds":{"document_bytes":16777216,"sheet_cells":100000,"rows_first":2000,"rows_last":500,"rows_between":2000,"halvings":0,"cell_chars":16384,"cell_head_chars":4096},"cells_cut":0,"cells_raw":0,"read":"whole","date_system":"1900"}

{"sheet":"Intro","index":0,"n_rows":51,"n_cols":4,"rows_kept":51,"cut":false,"hidden":false,"merged":[[18,2,18,3],[33,1,33,4],[21,2,21,3],[22,2,22,3],[23,2,23,3],[24,2,24,3],[19,2,19,3],[20,2,20,3],[35,2,35,3],[36,2,36,3],[0,2,0,3],[1,2,1,3],[3,2,3,3],[4,2,4,3],[7,1,7,4],[16,1,16,4],[14,3,14,4],[10,3,10,4],[11,3,11,4],[12,3,12,4],[13,3,13,4],[8,3,8,4],[9,3,9,4],[5,2,5,3],[46,1,46,4],[48,2,48,3],[40,2,40,3],[38,1,38,4],[42,1,42,4],[44,2,44,3]]}
[null,null,"HOME Investment Partnerships Program (\"HOME\")"]
[null,null,"Multi-Family Underwriting Template"]
[]
[null,null,"U.S. Department of Housing and Urban Development"]
[null,null,"Office of Community Planning and Development"]
[]
{"$rows_left_out":46}
{"sheet":"Controls","index":1,"n_rows":70,"n_cols":3,"rows_kept":70,"cut":false,"hidden":true,"merged":[]}
["Controls (Normally Hidden)","Don't insert rows or columns in A1:B24"]
[]
["Macro Controls"]
["Requirements tab hide-reveal starting column",{"$f":"COLUMN(Requirements!$K$1)","v":11}]
["Requirements tab hide-reveal ending column",{"$f":"COLUMN(Requirements!$R$1)","v":18}]
[]
{"$rows_left_out":65}
{"sheet":"Requirements","index":2,"n_rows":185,"n_cols":19,"rows_kept":185,"cut":false,"hidden":false,"merged":[[64,2,64,8],[78,2,78,8],[92,2,92,8],[106,2,106,8],[10,2,10,3],[0,2,0,6],[2,2,2,8],[68,5,68,6],[82,2,82,4],[82,5,82,6],[68,2,68,4],[37,2,37,5],[39,2,39,5],[54,2,54,4],[54,5,54,6],[14,2,14,3],[15,2,15,3],[38,2,38,5],[34,2,34,4],[35,2,35,4],[7,2,7,8],[166,2,166,8],[17,2,17,8],[31,2,31,8],[48,2,48,8],[11,2,11,3],[12,2,12,3],[13,2,13,3],[96,2,96,4],[96,5,96,6],[34,5,34,7],[35,5,35,7],[50,2,50,8],[110,2,110,4],[110,5,110,6],[120,2,120,8],[124,2,124,4],[152,2,152,4],[152,5,152,6],[162,2,162,8],[124,5,124,6],[134,2,134,8],[138,2,138,4],[138,5,138,6],[148,2,148,8]]}
[null,null,"HOME and Other Affordable Housing Requirements",null,null,null,null,null,"Enter data in green cells only"]
[]
[null,null,"The HOME Program, as well as other affordable housing programs (e.g., Low-Income Housing Tax Credits or the Community Development Block Grant), are designed to provide effective resources for housing development, while ensuring that use of public funds results in increased availability of affordable housing.  To meet the latter objective, the HOME Program and other affordable housing programs impose requirements and restrictions, such as maximum subsidies, maximum rents for units reserved for affordable housing, and affordability periods during which units must remain affordable.  \n\nNote that some individual units may be subsidized using both HOME funds and funds from another affordable housing program.  For the purposes of this Template, consider those units to be HOME-assisted units.\n\nUse this worksheet to enter (or change) the following: Area Median Incomes, rents, utility allowances, the HOME period of affordability, and HOME per-unit investment limits."]
[null,null,{"$f":"\"Project Name - \"&Intro!$D$9&\" : \"&'Rents and Income'!$E$31&\" Units\"","v":"Project Name -  : 0 Units"}]
[]
[null,null,"4 Person AMI",100600,"at 100% AMI"]
{"$rows_left_out":180}
{"sheet":"Rents and Income","index":3,"n_rows":53,"n_cols":35,"rows_kept":53,"cut":false,"hidden":false,"merged":[[50,2,50,21],[0,2,0,4],[0,5,0,8],[48,2,48,9],[4,12,4,16],[33,2,33,21],[48,11,48,17],[2,2,2,9],[31,2,31,3]]}
["?",null,"Rents and Income",null,null,"Enter data in green cells only",null,null,null,null,null,{"$f":"Requirements!C4","v":"Project Name -  : 0 Units"}]
[]
[null,null,"Use this worksheet to enter (or to modify) the unit mix, the mix of Low and High HOME units, the mix of LIHTC and CDBG and market rate units, and square footage for each unit type. Also use this worksheet to select the maximum rents that will be underwritten for each unit type, and to select utility allowances. Also use this worksheet to enter any 'other revenue' such as commercial revenue or tenant late fees.  Information for number of units, Low HOME units, High HOME units, LIHTC units, CDBG units, market rate units, square footage, underwritten rents, underwritten utility allowances, and underwritten other revenue will carry forward from this worksheet into the rest of the underwriting template."]
[]
[null,null,"?","?","?","?","?","?",null,"?",null,null,"Are these units:",null,null,null,null,"?",null,"?","?"]
["?",null,"Unit Type","Underwritten \nRent Level","Number of Units","Square Footage per Unit","Gross Rent, \nper unit,\nper month","Monthly Utility Allowance","Net Rent After Utilities, \nper unit, per month","Within Rent Limit?",null,"# of BRs?","Low HOME?","High HOME?","Market Rate \n(no rent limits)?","LIHTC?","CDBG?","Which Rent Should Be Underwritten (which limit is most restrictive)?","Gross Rent","Underwrite What % of the Maximum Rents?","Use Which Utility Allowance?","Utility Allowance",null,"Restricted Rents for HOME Units","Restricted Rents for Other Affordable Units","Rents for Market Units","Market Rents for HOME Units","Market Rents for Other Affordable Units","Square Feet for LIHTC Units","Square Feet for HOME Units","HOME Funding Limit (per unit)","HOME Funding Limit (HOME Assisted Units)"]
{"$rows_left_out":48}
{"sheet":"Development Costs","index":4,"n_rows":138,"n_cols":13,"rows_kept":138,"cut":false,"hidden":false,"merged":[[51,0,52,0],[62,0,63,0],[80,0,81,0],[71,0,72,0],[87,0,88,0],[8,0,9,0],[27,0,28,0],[30,0,31,0],[40,0,41,0],[38,0,39,0],[36,0,37,0],[12,0,13,0],[18,0,19,0],[126,4,126,6],[119,2,119,6],[132,4,132,6],[133,4,133,6],[127,4,127,6],[128,4,128,6],[129,4,129,6],[130,4,130,6],[131,4,131,6],[99,2,99,3],[124,4,124,6],[123,4,123,6],[125,4,125,6],[0,3,0,5],[121,2,121,6]]}
[null,null,"Development Costs","Enter data in green cells only"]
[null,null,{"$f":"Requirements!C4","v":"Project Name -  : 0 Units"}]
["?",null,"Cost","Amount","Cost Per Unit","Cost Per Square Foot","Comment",null,"LIHTC Acquisition Basis","LIHTC Construction Basis","Costs Outside Basis"]
["?",null,"Acquisition Costs"]
[null,null,"Land",null,{"$f":"IF(D5=0,\"need data\",IF('Rents and Income'!$E$31=0,0,D5/'Rents and Income'!$E$31))","v":"need data"},{"$f":"IF(ISERROR(IF(D5=0,\"need data\",D5/SUMPRODUCT('Rents and Income'!$E$7:$E$30*'Rents and Income'!$F$7:$F$30))),0,IF(D5=0,\"need data\",D5/SUMPRODUCT('Rents and Income'!$E$7:$E$30*'Rents and Income'!$F$7:$F$30)))","v":"need data"},null,null,0,0,{"$f":"+D5-I5-J5","v":0},null,"?"]
[null,null,"Existing Structures",null,{"$f":"IF(D6=0,\"need data\",IF('Rents and Income'!$E$31=0,0,D6/'Rents and Income'!$E$31))","v":"need data"},{"$f":"IF(ISERROR(IF(D6=0,\"need data\",D6/SUMPRODUCT('Rents and Income'!$E$7:$E$30*'Rents and Income'!$F$7:$F$30))),0,IF(D6=0,\"need data\",D6/SUMPRODUCT('Rents and Income'!$E$7:$E$30*'Rents and Income'!$F$7:$F$30)))","v":"need data"},null,null,{"$f":"+D6","v":0},0,{"$f":"+D6-I6-J6","v":0},null,"?"]
{"$rows_left_out":133}
{"sheet":"Repl Reserve","index":5,"n_rows":49,"n_cols":15,"rows_kept":49,"cut":false,"hidden":false,"merged":[[46,2,46,7],[0,3,0,7],[3,2,3,7],[40,2,40,7],[5,2,5,7],[42,2,42,7],[45,2,45,7],[43,2,43,7]]}
[null,null,"Replacement Reserve","Enter data in green cells only"]
[null,null,{"$f":"Requirements!C4","v":"Project Name -  : 0 Units"},null,null,null,null,null,null,{"$f":"+Requirements!$G$39","v":0},"Year PJ HOME Affordability Period"]
[]
[null,null,"For HOME rental projects involving rehabilitation, Section 92.250(b)(1) of the HOME Final Rule requires the PJ to estimate the long term capital needs of the project and to determine a replacement reserve funding approach that will allow 100% of estimated long term capital needs -- over the HOME period of affordability -- to be funded from the replacement reserve.  If the project has 26 total units or more, the PJ must require a capital needs assessment.  These requirements must be included in the PJ's underwriting standards for rental projects involving rehabilitation.\n\nThere is no similar requirement for new construction rental projects, but it would be a best practice for PJs to include a similar requirement in the PJ's underwriting standards for new construction rental projects."]
[]
[null,null,"This worksheet will allow the user to determine an annual replacement reserve deposit that will satisfy the 92.250(b) requirement, plus a higher annual reserve deposit that will be adequate over the long term (including the years after completion of the HOME period of affordability)."]
{"$rows_left_out":44}
{"sheet":"Const Schedule","index":6,"n_rows":44,"n_cols":14,"rows_kept":44,"cut":false,"hidden":false,"merged":[[38,2,38,8],[40,2,40,8],[31,2,31,8],[33,2,33,8],[36,2,36,8],[35,2,35,8],[3,2,3,8],[0,4,0,7],[21,2,21,8],[23,2,23,8],[26,2,26,8]]}
[null,null,"Construction Schedule",null,"Enter data in green cells only"]
[null,null,{"$f":"Requirements!C4","v":"Project Name -  : 0 Units"}]
[]
[null,null,"The HOME Final Rule's definition of commitment specifies that if a project includes rehabilitation or new construction, a construction schedule is required at or before the time of the commitment.  Additionally, construction must be scheduled to start within twelve months after the commitment date, and construction must be scheduled to be completed within four years after the commitment date.",null,null,null,null,null,null,null,"Total","Per Unit"]
[]
[null,null,"Intended HOME Commitment Date",null,null,null,null,null,null,null,{"$f":"+SUM('Development Costs'!$D$8:$D$17)+SUM('Development Costs'!$D$18:$D$22)","v":0},{"$f":"+K6/'Rents and Income'!$E$31","v":{"$error":"#DIV/0!"}},null,"Hard cost before contingency"]
{"$rows_left_out":39}
{"sheet":"LIHTC Basis","index":7,"n_rows":58,"n_cols":12,"rows_kept":58,"cut":false,"hidden":false,"merged":[[0,6,0,7],[3,2,3,8],[55,2,55,8]]}
[null,null,"LIHTC Basis",null,null,null,"Enter data in green cells only"]
[null,null,{"$f":"Requirements!C4","v":"Project Name -  : 0 Units"}]
[]
[null,null,"This tab is useful for projects that will have Low Income Housing Tax Credits (LIHTCs).  The purpose of this tab is to make a rough estimate of LIHTC equity, which you can use to compare to the developer's estimate.  If the rough estimate here is materially different from the developer's estimate, you should ask the developer for an explanation.\n\nTo enter (or change) the number of LIHTC units, use column P of the Rents and Income tab."]
[]
["?",null,"LIHTC Eligible Basis","Acquisition",null,"Construction"]
{"$rows_left_out":53}
{"sheet":"Operating Expenses","index":8,"n_rows":59,"n_cols":7,"rows_kept":59,"cut":false,"hidden":false,"merged":[[0,4,0,5],[9,0,10,0],[12,0,13,0],[17,0,18,0],[22,0,25,0],[56,2,56,6],[27,0,28,0],[30,0,32,0],[35,0,37,0],[39,0,40,0],[41,0,42,0]]}
["?",null,"Operating Expenses",null,"Enter data in green cells only"]
[null,null,{"$f":"Requirements!C4","v":"Project Name -  : 0 Units"}]
[null,null,"Expense","Annual Cost","Monthly Cost","Per Unit Per Year","Comment"]
[null,null,"Administrative / Management Expenses"]
["?",null,"Management Fee",null,{"$f":"D5/12","v":0},{"$f":"IF('Rents and Income'!$E$31=0,0,IF(D5=0,\"\",D5/'Rents and Income'!$E$31))","v":0}]
["?",null,"Management Administrative Payroll Costs",null,{"$f":"D6/12","v":0},{"$f":"IF('Rents and Income'!$E$31=0,0,IF(D6=0,\"\",D6/'Rents and Income'!$E$31))","v":0}]
{"$rows_left_out":54}
{"sheet":"First Mortgage Sizing","index":9,"n_rows":110,"n_cols":11,"rows_kept":110,"cut":false,"hidden":false,"merged":[[107,2,107,7],[47,2,47,7],[0,3,0,5],[18,4,18,6],[37,2,37,7],[25,2,25,7],[20,4,20,7],[23,2,23,7],[35,2,35,7]]}
["?",null,"First Mortgage Sizing and","Enter data in green cells only"]
[null,null,"Junior Loan Characteristics",{"$f":"Requirements!C4","v":"Project Name -  : 0 Units"}]
[]
["?",null,"Net Operating Income Summary","Annual","HOME Units","Other Affordable","Market Units"]
[]
[null,null,"Gross Potential Rents",{"$f":"+'Rents and Income'!I32","v":0},{"$f":"+'Rents and Income'!X31*12","v":0},{"$f":"+'Rents and Income'!Y31*12","v":0},{"$f":"+'Rents and Income'!Z31*12","v":0}]
{"$rows_left_out":105}
{"sheet":"Sources and Uses","index":10,"n_rows":50,"n_cols":17,"rows_kept":50,"cut":false,"hidden":false,"merged":[[3,14,6,14],[27,4,27,5],[28,4,28,5],[29,4,29,5],[4,2,4,5],[30,4,30,5],[31,4,31,5],[32,4,32,5],[33,4,33,5],[34,4,34,5],[46,2,46,5],[35,4,35,5],[36,4,36,5],[37,4,37,5],[38,4,38,5],[39,4,39,5]]}
[null,null,"Sources and Uses of Funds",null,null,"Enter data in green cells only"]
[]
[null,null,{"$f":"Requirements!C4","v":"Project Name -  : 0 Units"}]
[null,null,null,null,null,null,null,null,null,null,null,null,null,null,"Amounts Funded by HOME"]
[null,null,"In this template, the underwriter enters all proposed Sources of Funds (including HOME) on this tab (other than those that were already entered on the First Mortgage Sizing tab).  The Uses of Funds are repeated below (from the Development Costs tab).  Then the template verifies whether the Sources and Uses are in balance; be sure that Sources and Uses are balanced before moving forward.  If there are insufficient Sources, potential solutions include deferring a greater portion of the developer fee, increasing HOME funding, and obtaining increased funding from some other source.  If there are excess Sources, the HOME underwriter should consider reducing the proposed HOME funding.\n\nPJs must perform cost allocation separately from this tool to verify that the proposed amount of HOME funding is within the allowable maximum HOME investment."]
[]
{"$rows_left_out":45}
{"sheet":"S&U By Month","index":11,"n_rows":130,"n_cols":32,"rows_kept":130,"cut":false,"hidden":false,"merged":[[129,2,129,3],[125,2,125,3],[3,24,5,24],[3,25,5,25],[3,26,5,26],[123,5,123,8],[127,2,127,5],[3,27,5,27],[3,6,5,6],[3,28,5,28],[3,23,5,23],[3,9,5,9],[3,8,5,8],[3,7,5,7],[3,18,5,18],[3,19,5,19],[3,20,5,20],[3,21,5,21],[3,22,5,22],[0,3,0,5],[3,5,5,5],[3,17,5,17],[3,16,5,16],[3,15,5,15],[3,14,5,14],[3,13,5,13],[3,12,5,12],[3,11,5,11],[3,10,5,10]]}
["?",null,"Sources and Uses by Month","Enter data in green cells only"]
[null,null,{"$f":"Requirements!C4","v":"Project Name -  : 0 Units"}]
[null,null,null,null,0,1,{"$f":"+F3+1","v":2},{"$f":"+G3+1","v":3},4,5,6,7,8,9,10,11,12,{"$f":"+Q3+1","v":13},14,15,16,17,18,19,20,21,22,23,24]
[null,null,"Months of Construction",{"$f":"ROUND('Development Costs'!D104,0)","v":0},null,{"$f":"IF(F3=$D$4,\"Construction Completion\",IF(F3=$D$4+$D$5,\"Const. Loan Payoff\",\"\"))","v":""},"","","","","","","","","","","","","","","","","","","","","","",""]
[null,null,"Months Const. Loan Outstanding After Completion",{"$f":"ROUND('Development Costs'!D105,0)","v":0}]
[]
{"$rows_left_out":125}
{"sheet":"Pro Forma Assumptions","index":12,"n_rows":43,"n_cols":6,"rows_kept":43,"cut":false,"hidden":false,"merged":[[0,4,1,5],[40,2,40,5]]}
["?",null,"Key Assumptions",null,"Enter data in green cells only"]
[null,null,"For Operating Pro Forma"]
[null,null,{"$f":"Requirements!C4","v":"Project Name -  : 0 Units"}]
[]
[null,null,"HOME Affordability Period",{"$f":"+Requirements!G39","v":0},"years"]
[null,null,"Go to the Requirements tab to adjust the HOME affordability period"]
{"$rows_left_out":38}
{"sheet":"Operating Pro Forma","index":13,"n_rows":110,"n_cols":33,"rows_kept":110,"cut":false,"hidden":false,"merged":[[44,3,44,5],[45,3,45,5],[1,4,1,11]]}
[null,null,"Operating Pro-Forma",null,"\"####\" indicates that the columns should be widened.",null,null,null,null,null,null,{"$f":"Requirements!C4","v":"Project Name -  : 0 Units"}]
[null,null,null,null,"The only data entry cells on this tab are for payments on any 'custom loans' (see rows 31 and 32)."]
["?",null,"PROJECT TIMELINE"]
[null,null,null,"Year 1","Year 2","Year 3","Year 4","Year 5","Year 6","Year 7","Year 8","Year 9","Year 10","Year 11","Year 12","Year 13","Year 14","Year 15","Year 16","Year 17","Year 18","Year 19","Year 20","Year 21","Year 22","Year 23","Year 24","Year 25","Year 26","Year 27","Year 28","Year 29","Year 30"]
[null,null,null,1,2,3,4,5,6,7,8,9,10,11,12,13,14,15,16,17,18,19,20,21,22,23,24,25,26,27,28,29,30]
[null,null,"Gross Potential Rent (GPR) Projections"]
{"$rows_left_out":105}
{"sheet":"Administrative Record","index":14,"n_rows":46,"n_cols":5,"rows_kept":46,"cut":false,"hidden":false,"merged":[[15,2,15,7],[18,2,18,7],[20,2,20,7],[23,2,23,7],[3,2,3,7],[10,2,10,7],[13,2,13,7],[5,2,5,7],[8,2,8,7],[7,2,7,7],[42,2,42,7],[0,4,0,7],[12,2,12,7],[40,2,40,7],[43,2,43,7],[22,2,22,7],[27,2,27,7],[32,2,32,7],[37,2,37,7],[25,2,25,7],[28,2,28,7],[30,2,30,7],[33,2,33,7],[35,2,35,7],[38,2,38,7],[17,2,17,7]]}
[null,null,"Administrative Record",null,"Enter data in green cells only"]
[null,null,{"$f":"Requirements!C4","v":"Project Name -  : 0 Units"}]
[]
[null,null,"This is an optional worksheet that the PJ can use to document compliance with certain requirements of the HOME Final Rule."]
[]
[null,null,"Cost Allocation. Section 92.205(d)(1) and the guidance in Notice 16-15 prescribes methods for allocating costs and the designation of HOME units within a project.  PJs must perform cost allocation separately from this tool to verify that the proposed amount of HOME funding is within the allowable maximum HOME investment.  Attach the completed cost allocation to this document and note any issues within the below narrative."]
{"$rows_left_out":41}
{"sheet":"Summary","index":15,"n_rows":83,"n_cols":13,"rows_kept":83,"cut":false,"hidden":false,"merged":[[54,5,55,5],[43,5,43,7],[44,5,44,7],[45,5,45,7],[46,5,46,7],[47,5,47,7],[38,5,38,7],[39,5,39,7],[40,5,40,7],[41,5,41,7],[42,5,42,7],[29,5,29,7],[34,5,34,7],[35,5,35,7],[36,5,36,7],[37,5,37,7],[24,5,24,7],[28,5,28,7],[25,5,25,7],[26,5,26,7],[27,5,27,7],[80,6,80,7],[80,8,80,10],[78,6,78,7],[78,8,78,10],[79,6,79,7],[79,8,79,10],[6,4,6,9],[7,4,7,9],[8,4,8,9],[2,4,2,9],[3,4,3,9],[4,4,4,9],[5,4,5,9],[13,5,13,7],[14,5,14,7],[15,5,15,7],[62,6,62,7],[64,8,64,10],[64,6,64,7],[62,8,62,10],[63,8,63,10],[63,6,63,7],[16,5,16,7],[17,5,17,7],[18,5,18,7],[19,5,19,7],[21,5,21,7],[22,5,22,7],[23,5,23,7],[67,6,67,7],[68,6,68,7],[65,6,65,7],[66,6,66,7],[66,8,66,10],[67,8,67,10],[65,8,65,10],[74,6,74,7],[74,8,74,10],[68,8,68,10],[69,8,69,10],[70,8,70,10],[71,8,71,10],[73,8,73,10],[72,8,72,10],[73,6,73,7],[71,6,71,7],[69,6,69,7],[70,6,70,7],[72,6,72,7]]}
["?",null,null,"PROJECT SUMMARY"]
[]
[null,null,null,"Project Name and Unit Count:",{"$f":"IF(Intro!D9>0,Intro!D9&\" : \"&'Rents and Income'!E31&\" Units\",\"\")","v":""}]
[null,null,null,{"$f":"Intro!C10","v":"Address:"},{"$f":"IF(Intro!D10>0,Intro!D10,\"\")","v":""}]
[null,null,null,{"$f":"Intro!C11","v":"Developer:"},{"$f":"IF(Intro!D11>0,Intro!D11,\"\")","v":""}]
[null,null,null,{"$f":"Intro!C12","v":"Date of Analysis:"},{"$f":"IF(Intro!D12>0,Intro!D12,\"\")","v":""}]
{"$rows_left_out":77}